← Back to All Reports
TESTS FAILED (8%)
Job Name
publisher_facebook_test03
Pipeline ID
Job ID
#4448381
Branch
master
Commit
N/A
Executed At
2026-10-13T08:28:08.484960
1
Passed
11
Failed
0
Skipped

Test Results (12 tests)

test_pu02_publish_fb_reel[chromium]
failed
⏱️ Duration: 18.26s
❌ Error:
self = <test_publisher.TestPublisherFacebook object at 0x7fe520fa68f0> login_page = <pages.login_page.LoginPage object at 0x7fe520fc20b0> create_page = <pages.create_page.CreatePage object at 0x7fe520385180> editor_page = <pages.editor_page.EditorPage object at 0x7fe520440f70> publish_page = <pages.publish_page.PublishPage object at 0x7fe520385930> dashboard_page = <pages.dashboard_page.DashboardPage object at 0x7fe5205752d0> publisher_page = <pages.publisher_page.PublisherPage object at 0x7fe520fc3190> base_url = 'https://test03.testingpromo.com' @pytest.mark.skip_smoke @pytest.mark.skip_sanity def test_pu02_publish_fb_reel( self, login_page, create_page, editor_page, publish_page, dashboard_page, publisher_page, base_url ): login_page.login_directly(base_url, general_mail(), get_password()) create_page.navigate_to_create(base_url) > create_page.search_for("cats") tests/publisher_facebook/test_publisher.py:89: _ _ _ _ _ _ _ _ _ _ _ _ _ _ _ _ _ _ _ _ _ _ _ _ _ _ _ _ _ _ _ _ _ _ _ _ _ _ _ _ pages/create_page.py:77: in search_for self.page.locator(self.SEARCH_INPUT).wait_for(state="visible", timeout=self.T_LOAD) /usr/local/lib/python3.10/dist-packages/playwright/sync_api/_generated.py:20539: in wait_for self._sync( /usr/local/lib/python3.10/dist-packages/playwright/_impl/_locator.py:748: in wait_for await self._frame.wait_for_selector( /usr/local/lib/python3.10/dist-packages/playwright/_impl/_frame.py:394: in wait_for_selector await self._channel.send( /usr/local/lib/python3.10/dist-packages/playwright/_impl/_connection.py:76: in send return await self._connection.wrap_api_call( _ _ _ _ _ _ _ _ _ _ _ _ _ _ _ _ _ _ _ _ _ _ _ _ _ _ _ _ _ _ _ _ _ _ _ _ _ _ _ _ self = <playwright._impl._connection.Connection object at 0x7fe520fc3850> cb = <function Channel.send.<locals>.<lambda> at 0x7fe52042a4d0> is_internal = False, title = None async def wrap_api_call( self, cb: Callable[[], Any],
📸 Failure Screenshot:
Test failure screenshot
test_pu03_schedule_fb_post_happy_path[chromium]
failed
⏱️ Duration: 70.37s
❌ Error:
self = <test_publisher.TestPublisherFacebook object at 0x7fe520fa6f20> login_page = <pages.login_page.LoginPage object at 0x7fe51b4a0bb0> dashboard_page = <pages.dashboard_page.DashboardPage object at 0x7fe51b4a1690> publish_page = <pages.publish_page.PublishPage object at 0x7fe51b4a1810> publisher_page = <pages.publisher_page.PublisherPage object at 0x7fe51b4a0cd0> planner_page = <pages.planner_page.PlannerPage object at 0x7fe5199171c0> base_url = 'https://test03.testingpromo.com' def test_pu03_schedule_fb_post_happy_path( self, login_page, dashboard_page, publish_page, publisher_page, planner_page, base_url ): login_page.login_directly(base_url, general_mail(), get_password()) planner_page.go_to_my_calendar(base_url) planner_page.verify_on_planner() planner_page.clean_scheduled_posts_precondition() > dashboard_page.go_to_published(base_url) tests/publisher_facebook/test_publisher.py:129: _ _ _ _ _ _ _ _ _ _ _ _ _ _ _ _ _ _ _ _ _ _ _ _ _ _ _ _ _ _ _ _ _ _ _ _ _ _ _ _ pages/dashboard_page.py:59: in go_to_published self.page.goto(f"{base_url}/dashboard#published") /usr/local/lib/python3.10/dist-packages/playwright/sync_api/_generated.py:9875: in goto self._sync( /usr/local/lib/python3.10/dist-packages/playwright/_impl/_page.py:560: in goto return await self._main_frame.goto(**locals_to_params(locals())) /usr/local/lib/python3.10/dist-packages/playwright/_impl/_frame.py:156: in goto await self._channel.send( /usr/local/lib/python3.10/dist-packages/playwright/_impl/_connection.py:76: in send return await self._connection.wrap_api_call( _ _ _ _ _ _ _ _ _ _ _ _ _ _ _ _ _ _ _ _ _ _ _ _ _ _ _ _ _ _ _ _ _ _ _ _ _ _ _ _ self = <playwright._impl._connection.Connection object at 0x7fe520fc3850> cb = <function Channel.send.<locals>.<lambda> at 0x7fe519795c60> is_internal = False, title = None async def wrap_api_call( self, cb: Callable[[], Any], is_internal: bool = False, titl
📸 Failure Screenshot:
Test failure screenshot
test_pu04_publish_empty_post_shows_error[chromium]
failed
⏱️ Duration: 44.12s
❌ Error:
self = <test_publisher.TestPublisherFacebook object at 0x7fe520fa76a0> login_page = <pages.login_page.LoginPage object at 0x7fe51969aaa0> dashboard_page = <pages.dashboard_page.DashboardPage object at 0x7fe51969ad70> publish_page = <pages.publish_page.PublishPage object at 0x7fe519698160> publisher_page = <pages.publisher_page.PublisherPage object at 0x7fe51969b760> planner_page = <pages.planner_page.PlannerPage object at 0x7fe51969baf0> base_url = 'https://test03.testingpromo.com' @pytest.mark.skip_smoke @pytest.mark.skip_sanity def test_pu04_publish_empty_post_shows_error( self, login_page, dashboard_page, publish_page, publisher_page, planner_page, base_url ): login_page.login_directly(base_url, general_mail(), get_password()) planner_page.go_to_my_calendar(base_url) planner_page.verify_on_planner() planner_page.clean_scheduled_posts_precondition() dashboard_page.go_to_published(base_url) dashboard_page.delete_first_vertical_project() dashboard_page.republish_first_video() publish_page.wait_for_render_and_verify() publish_page.click_schedule_to_social() publisher_page.verify_redirected_to_publisher() publisher_page.select_facebook_page() publisher_page.click_publish_header() publisher_page.attempt_publish_without_video() publisher_page.go_back_to_publish_page() > assert publisher_page.page.title() == publish_page.PUBLISH_PAGE_TITLE E AssertionError: assert '' == 'Promo - Publish Video' E E - Promo - Publish Video tests/publisher_facebook/test_publisher.py:180: AssertionError
📸 Failure Screenshot:
Test failure screenshot
test_pu05a_schedule_and_edit_post[chromium]
passed
⏱️ Duration: 64.97s
test_pu05b_reschedule_post[chromium]
failed
⏱️ Duration: 59.79s
❌ Error:
self = <test_publisher.TestPublisherFacebook object at 0x7fe520fa7e50> login_page = <pages.login_page.LoginPage object at 0x7fe5195d6c80> dashboard_page = <pages.dashboard_page.DashboardPage object at 0x7fe5195d5f30> publish_page = <pages.publish_page.PublishPage object at 0x7fe5195d6170> publisher_page = <pages.publisher_page.PublisherPage object at 0x7fe5195d5f60> planner_page = <pages.planner_page.PlannerPage object at 0x7fe5195d7610> base_url = 'https://test03.testingpromo.com' @pytest.mark.skip_smoke def test_pu05b_reschedule_post( self, login_page, dashboard_page, publish_page, publisher_page, planner_page, base_url ): login_page.login_directly(base_url, general_mail(), get_password()) planner_page.go_to_my_calendar(base_url) planner_page.verify_on_planner() planner_page.clean_scheduled_posts_precondition() > dashboard_page.go_to_published(base_url) tests/publisher_facebook/test_publisher.py:239: _ _ _ _ _ _ _ _ _ _ _ _ _ _ _ _ _ _ _ _ _ _ _ _ _ _ _ _ _ _ _ _ _ _ _ _ _ _ _ _ pages/dashboard_page.py:59: in go_to_published self.page.goto(f"{base_url}/dashboard#published") /usr/local/lib/python3.10/dist-packages/playwright/sync_api/_generated.py:9875: in goto self._sync( /usr/local/lib/python3.10/dist-packages/playwright/_impl/_page.py:560: in goto return await self._main_frame.goto(**locals_to_params(locals())) /usr/local/lib/python3.10/dist-packages/playwright/_impl/_frame.py:156: in goto await self._channel.send( /usr/local/lib/python3.10/dist-packages/playwright/_impl/_connection.py:76: in send return await self._connection.wrap_api_call( _ _ _ _ _ _ _ _ _ _ _ _ _ _ _ _ _ _ _ _ _ _ _ _ _ _ _ _ _ _ _ _ _ _ _ _ _ _ _ _ self = <playwright._impl._connection.Connection object at 0x7fe520fc3850> cb = <function Channel.send.<locals>.<lambda> at 0x7fe519369cf0> is_internal = False, title = None async def wrap_api_call( self, cb: Callable[[], Any], is_internal: b
📸 Failure Screenshot:
Test failure screenshot
test_pu06_new_post_button_today_and_tomorrow[chromium]
failed
⏱️ Duration: 30.01s
❌ Error:
self = <test_publisher.TestPublisherFacebook object at 0x7fe520fc2f80> login_page = <pages.login_page.LoginPage object at 0x7fe52040ef80> planner_page = <pages.planner_page.PlannerPage object at 0x7fe52040ebc0> publisher_page = <pages.publisher_page.PublisherPage object at 0x7fe52040f220> base_url = 'https://test03.testingpromo.com' def test_pu06_new_post_button_today_and_tomorrow( self, login_page, planner_page, publisher_page, base_url ): > login_page.login_directly(base_url, general_mail(), get_password()) tests/publisher_facebook/test_publisher.py:279: _ _ _ _ _ _ _ _ _ _ _ _ _ _ _ _ _ _ _ _ _ _ _ _ _ _ _ _ _ _ _ _ _ _ _ _ _ _ _ _ pages/login_page.py:107: in login_directly self.go_to_login_page(base_url) pages/login_page.py:43: in go_to_login_page self.page.goto(f"{base_url}/login", wait_until="domcontentloaded") /usr/local/lib/python3.10/dist-packages/playwright/sync_api/_generated.py:9875: in goto self._sync( /usr/local/lib/python3.10/dist-packages/playwright/_impl/_page.py:560: in goto return await self._main_frame.goto(**locals_to_params(locals())) /usr/local/lib/python3.10/dist-packages/playwright/_impl/_frame.py:156: in goto await self._channel.send( /usr/local/lib/python3.10/dist-packages/playwright/_impl/_connection.py:76: in send return await self._connection.wrap_api_call( _ _ _ _ _ _ _ _ _ _ _ _ _ _ _ _ _ _ _ _ _ _ _ _ _ _ _ _ _ _ _ _ _ _ _ _ _ _ _ _ self = <playwright._impl._connection.Connection object at 0x7fe520fc3850> cb = <function Channel.send.<locals>.<lambda> at 0x7fe5195785e0> is_internal = False, title = None async def wrap_api_call( self, cb: Callable[[], Any], is_internal: bool = False, title: str = None ) -> Any: if self._api_zone.get(): return await cb() task = asyncio.current_task(self._loop) parsed_st = _attach_api_call_information( getattr(task, "__pw_stack__", None) or _capture_stack_trace(), is_internal,
test_pu07_duplicate_published_post_from_planner[chromium]
failed
⏱️ Duration: 30.01s
❌ Error:
self = <test_publisher.TestPublisherFacebook object at 0x7fe520fc3520> login_page = <pages.login_page.LoginPage object at 0x7fe51964cf70> dashboard_page = <pages.dashboard_page.DashboardPage object at 0x7fe51964cca0> publish_page = <pages.publish_page.PublishPage object at 0x7fe51964c6d0> publisher_page = <pages.publisher_page.PublisherPage object at 0x7fe51964d7e0> planner_page = <pages.planner_page.PlannerPage object at 0x7fe51964dde0> base_url = 'https://test03.testingpromo.com' @pytest.mark.skip_smoke def test_pu07_duplicate_published_post_from_planner( self, login_page, dashboard_page, publish_page, publisher_page, planner_page, base_url ): > login_page.login_directly(base_url, general_mail(), get_password()) tests/publisher_facebook/test_publisher.py:313: _ _ _ _ _ _ _ _ _ _ _ _ _ _ _ _ _ _ _ _ _ _ _ _ _ _ _ _ _ _ _ _ _ _ _ _ _ _ _ _ pages/login_page.py:107: in login_directly self.go_to_login_page(base_url) pages/login_page.py:43: in go_to_login_page self.page.goto(f"{base_url}/login", wait_until="domcontentloaded") /usr/local/lib/python3.10/dist-packages/playwright/sync_api/_generated.py:9875: in goto self._sync( /usr/local/lib/python3.10/dist-packages/playwright/_impl/_page.py:560: in goto return await self._main_frame.goto(**locals_to_params(locals())) /usr/local/lib/python3.10/dist-packages/playwright/_impl/_frame.py:156: in goto await self._channel.send( /usr/local/lib/python3.10/dist-packages/playwright/_impl/_connection.py:76: in send return await self._connection.wrap_api_call( _ _ _ _ _ _ _ _ _ _ _ _ _ _ _ _ _ _ _ _ _ _ _ _ _ _ _ _ _ _ _ _ _ _ _ _ _ _ _ _ self = <playwright._impl._connection.Connection object at 0x7fe520fc3850> cb = <function Channel.send.<locals>.<lambda> at 0x7fe51936ba30> is_internal = False, title = None async def wrap_api_call( self, cb: Callable[[], Any], is_internal: bool = False, title: str = None ) -> Any: if self._api_zone.get(): ret
test_pu08_duplicate_scheduled_post_from_planner[chromium]
failed
⏱️ Duration: 20.17s
❌ Error:
self = <test_publisher.TestPublisherFacebook object at 0x7fe520fc3e20> login_page = <pages.login_page.LoginPage object at 0x7fe5198d88e0> dashboard_page = <pages.dashboard_page.DashboardPage object at 0x7fe5198d8490> publish_page = <pages.publish_page.PublishPage object at 0x7fe5198d8310> publisher_page = <pages.publisher_page.PublisherPage object at 0x7fe5198dae30> planner_page = <pages.planner_page.PlannerPage object at 0x7fe5198db2e0> base_url = 'https://test03.testingpromo.com' @pytest.mark.skip_smoke @pytest.mark.skip_sanity def test_pu08_duplicate_scheduled_post_from_planner( self, login_page, dashboard_page, publish_page, publisher_page, planner_page, base_url ): > login_page.login_directly(base_url, general_mail(), get_password()) tests/publisher_facebook/test_publisher.py:354: _ _ _ _ _ _ _ _ _ _ _ _ _ _ _ _ _ _ _ _ _ _ _ _ _ _ _ _ _ _ _ _ _ _ _ _ _ _ _ _ pages/login_page.py:109: in login_directly self.enter_email(email) pages/login_page.py:73: in enter_email self.page.locator(self.EMAIL_INPUT).fill(email) /usr/local/lib/python3.10/dist-packages/playwright/sync_api/_generated.py:18242: in fill self._sync( /usr/local/lib/python3.10/dist-packages/playwright/_impl/_locator.py:219: in fill return await self._frame.fill(self._selector, strict=True, **params) /usr/local/lib/python3.10/dist-packages/playwright/_impl/_frame.py:636: in fill await self._fill(**locals_to_params(locals())) /usr/local/lib/python3.10/dist-packages/playwright/_impl/_frame.py:648: in _fill await self._channel.send("fill", self._timeout, locals_to_params(locals())) /usr/local/lib/python3.10/dist-packages/playwright/_impl/_connection.py:76: in send return await self._connection.wrap_api_call( _ _ _ _ _ _ _ _ _ _ _ _ _ _ _ _ _ _ _ _ _ _ _ _ _ _ _ _ _ _ _ _ _ _ _ _ _ _ _ _ self = <playwright._impl._connection.Connection object at 0x7fe520fc3850> cb = <function Channel.send.<locals>.<lambda> at 0x7fe518a25120> is_internal = False,
📸 Failure Screenshot:
Test failure screenshot
test_pu09_create_another_post_from_summary[chromium]
failed
⏱️ Duration: 20.18s
❌ Error:
self = <test_publisher.TestPublisherFacebook object at 0x7fe520fc0970> login_page = <pages.login_page.LoginPage object at 0x7fe519857130> planner_page = <pages.planner_page.PlannerPage object at 0x7fe5198571c0> publisher_page = <pages.publisher_page.PublisherPage object at 0x7fe519857520> base_url = 'https://test03.testingpromo.com' @pytest.mark.skip_smoke @pytest.mark.skip_sanity def test_pu09_create_another_post_from_summary( self, login_page, planner_page, publisher_page, base_url ): > login_page.login_directly(base_url, general_mail(), get_password()) tests/publisher_facebook/test_publisher.py:419: _ _ _ _ _ _ _ _ _ _ _ _ _ _ _ _ _ _ _ _ _ _ _ _ _ _ _ _ _ _ _ _ _ _ _ _ _ _ _ _ pages/login_page.py:109: in login_directly self.enter_email(email) pages/login_page.py:73: in enter_email self.page.locator(self.EMAIL_INPUT).fill(email) /usr/local/lib/python3.10/dist-packages/playwright/sync_api/_generated.py:18242: in fill self._sync( /usr/local/lib/python3.10/dist-packages/playwright/_impl/_locator.py:219: in fill return await self._frame.fill(self._selector, strict=True, **params) /usr/local/lib/python3.10/dist-packages/playwright/_impl/_frame.py:636: in fill await self._fill(**locals_to_params(locals())) /usr/local/lib/python3.10/dist-packages/playwright/_impl/_frame.py:648: in _fill await self._channel.send("fill", self._timeout, locals_to_params(locals())) /usr/local/lib/python3.10/dist-packages/playwright/_impl/_connection.py:76: in send return await self._connection.wrap_api_call( _ _ _ _ _ _ _ _ _ _ _ _ _ _ _ _ _ _ _ _ _ _ _ _ _ _ _ _ _ _ _ _ _ _ _ _ _ _ _ _ self = <playwright._impl._connection.Connection object at 0x7fe520fc3850> cb = <function Channel.send.<locals>.<lambda> at 0x7fe5198235b0> is_internal = False, title = None async def wrap_api_call( self, cb: Callable[[], Any], is_internal: bool = False, title: str = None ) -> Any: if self._api_zone.get(): ret
📸 Failure Screenshot:
Test failure screenshot
test_pu10_upload_to_fb_ad_manager[chromium]
failed
⏱️ Duration: 20.21s
❌ Error:
self = <test_publisher.TestPublisherFacebook object at 0x7fe520fc02b0> login_page = <pages.login_page.LoginPage object at 0x7fe5197f4970> dashboard_page = <pages.dashboard_page.DashboardPage object at 0x7fe5197f4c10> publish_page = <pages.publish_page.PublishPage object at 0x7fe5197f5300> publisher_page = <pages.publisher_page.PublisherPage object at 0x7fe5197f54e0> base_url = 'https://test03.testingpromo.com' @pytest.mark.skip_smoke @pytest.mark.skip_sanity def test_pu10_upload_to_fb_ad_manager( self, login_page, dashboard_page, publish_page, publisher_page, base_url ): > login_page.login_directly(base_url, general_mail(), get_password()) tests/publisher_facebook/test_publisher.py:442: _ _ _ _ _ _ _ _ _ _ _ _ _ _ _ _ _ _ _ _ _ _ _ _ _ _ _ _ _ _ _ _ _ _ _ _ _ _ _ _ pages/login_page.py:109: in login_directly self.enter_email(email) pages/login_page.py:73: in enter_email self.page.locator(self.EMAIL_INPUT).fill(email) /usr/local/lib/python3.10/dist-packages/playwright/sync_api/_generated.py:18242: in fill self._sync( /usr/local/lib/python3.10/dist-packages/playwright/_impl/_locator.py:219: in fill return await self._frame.fill(self._selector, strict=True, **params) /usr/local/lib/python3.10/dist-packages/playwright/_impl/_frame.py:636: in fill await self._fill(**locals_to_params(locals())) /usr/local/lib/python3.10/dist-packages/playwright/_impl/_frame.py:648: in _fill await self._channel.send("fill", self._timeout, locals_to_params(locals())) /usr/local/lib/python3.10/dist-packages/playwright/_impl/_connection.py:76: in send return await self._connection.wrap_api_call( _ _ _ _ _ _ _ _ _ _ _ _ _ _ _ _ _ _ _ _ _ _ _ _ _ _ _ _ _ _ _ _ _ _ _ _ _ _ _ _ self = <playwright._impl._connection.Connection object at 0x7fe520fc3850> cb = <function Channel.send.<locals>.<lambda> at 0x7fe519939c60> is_internal = False, title = None async def wrap_api_call( self, cb: Callable[[], Any], is_internal: bool = F
📸 Failure Screenshot:
Test failure screenshot
test_pu11_save_social_post_as_draft[chromium-publish]
failed
⏱️ Duration: 20.18s
❌ Error:
self = <test_publisher.TestPublisherFacebook object at 0x7fe520fc08b0> pub_type = 'publish' login_page = <pages.login_page.LoginPage object at 0x7fe519338670> dashboard_page = <pages.dashboard_page.DashboardPage object at 0x7fe51933a980> publish_page = <pages.publish_page.PublishPage object at 0x7fe519338520> publisher_page = <pages.publisher_page.PublisherPage object at 0x7fe5193383d0> planner_page = <pages.planner_page.PlannerPage object at 0x7fe519338ee0> base_url = 'https://test03.testingpromo.com' @pytest.mark.skip_smoke @pytest.mark.parametrize("pub_type", ["publish", "schedule"]) def test_pu11_save_social_post_as_draft( self, pub_type, login_page, dashboard_page, publish_page, publisher_page, planner_page, base_url ): > login_page.login_directly(base_url, general_mail(), get_password()) tests/publisher_facebook/test_publisher.py:466: _ _ _ _ _ _ _ _ _ _ _ _ _ _ _ _ _ _ _ _ _ _ _ _ _ _ _ _ _ _ _ _ _ _ _ _ _ _ _ _ pages/login_page.py:109: in login_directly self.enter_email(email) pages/login_page.py:73: in enter_email self.page.locator(self.EMAIL_INPUT).fill(email) /usr/local/lib/python3.10/dist-packages/playwright/sync_api/_generated.py:18242: in fill self._sync( /usr/local/lib/python3.10/dist-packages/playwright/_impl/_locator.py:219: in fill return await self._frame.fill(self._selector, strict=True, **params) /usr/local/lib/python3.10/dist-packages/playwright/_impl/_frame.py:636: in fill await self._fill(**locals_to_params(locals())) /usr/local/lib/python3.10/dist-packages/playwright/_impl/_frame.py:648: in _fill await self._channel.send("fill", self._timeout, locals_to_params(locals())) /usr/local/lib/python3.10/dist-packages/playwright/_impl/_connection.py:76: in send return await self._connection.wrap_api_call( _ _ _ _ _ _ _ _ _ _ _ _ _ _ _ _ _ _ _ _ _ _ _ _ _ _ _ _ _ _ _ _ _ _ _ _ _ _ _ _ self = <playwright._impl._connection.Connection object at 0x7fe520fc3850> cb = <function Channel.send.<l
📸 Failure Screenshot:
Test failure screenshot
test_pu11_save_social_post_as_draft[chromium-schedule]
failed
⏱️ Duration: 20.21s
❌ Error:
self = <test_publisher.TestPublisherFacebook object at 0x7fe520fc0790> pub_type = 'schedule' login_page = <pages.login_page.LoginPage object at 0x7fe518afa8c0> dashboard_page = <pages.dashboard_page.DashboardPage object at 0x7fe518afb340> publish_page = <pages.publish_page.PublishPage object at 0x7fe518afb370> publisher_page = <pages.publisher_page.PublisherPage object at 0x7fe518afb3a0> planner_page = <pages.planner_page.PlannerPage object at 0x7fe518afa110> base_url = 'https://test03.testingpromo.com' @pytest.mark.skip_smoke @pytest.mark.parametrize("pub_type", ["publish", "schedule"]) def test_pu11_save_social_post_as_draft( self, pub_type, login_page, dashboard_page, publish_page, publisher_page, planner_page, base_url ): > login_page.login_directly(base_url, general_mail(), get_password()) tests/publisher_facebook/test_publisher.py:466: _ _ _ _ _ _ _ _ _ _ _ _ _ _ _ _ _ _ _ _ _ _ _ _ _ _ _ _ _ _ _ _ _ _ _ _ _ _ _ _ pages/login_page.py:109: in login_directly self.enter_email(email) pages/login_page.py:73: in enter_email self.page.locator(self.EMAIL_INPUT).fill(email) /usr/local/lib/python3.10/dist-packages/playwright/sync_api/_generated.py:18242: in fill self._sync( /usr/local/lib/python3.10/dist-packages/playwright/_impl/_locator.py:219: in fill return await self._frame.fill(self._selector, strict=True, **params) /usr/local/lib/python3.10/dist-packages/playwright/_impl/_frame.py:636: in fill await self._fill(**locals_to_params(locals())) /usr/local/lib/python3.10/dist-packages/playwright/_impl/_frame.py:648: in _fill await self._channel.send("fill", self._timeout, locals_to_params(locals())) /usr/local/lib/python3.10/dist-packages/playwright/_impl/_connection.py:76: in send return await self._connection.wrap_api_call( _ _ _ _ _ _ _ _ _ _ _ _ _ _ _ _ _ _ _ _ _ _ _ _ _ _ _ _ _ _ _ _ _ _ _ _ _ _ _ _ self = <playwright._impl._connection.Connection object at 0x7fe520fc3850> cb = <function Channel.send.<
📸 Failure Screenshot:
Test failure screenshot